{"text_format":"1","workbook":"xlsx","n_sheets":2,"sheets":["Blanket","Alias"],"not_rendered":{"charts":0,"images":1,"macros":1,"external_links":1,"defined_names":2,"comments":0,"pivot_tables":0},"unopened":[],"bounds":{"document_bytes":16777216,"sheet_cells":100000,"rows_first":2000,"rows_last":500,"rows_between":2000,"halvings":0,"cell_chars":16384,"cell_head_chars":4096},"cells_cut":0,"cells_raw":0,"read":"whole","date_system":"1900"}

{"sheet":"Blanket","index":0,"n_rows":57,"n_cols":9,"rows_kept":57,"cut":false,"hidden":false,"merged":[[49,6,49,7],[50,6,50,7],[28,0,28,1],[29,0,29,1],[30,0,30,1],[28,6,28,7],[34,3,34,8],[47,6,47,7],[48,6,48,7],[33,3,33,8],[45,6,45,7],[45,3,45,4],[35,3,35,8],[30,2,30,3],[44,3,44,4],[31,0,31,8],[54,0,54,2],[55,0,55,2],[56,0,56,2],[45,0,45,1],[33,0,33,1],[44,0,44,1],[47,0,48,1],[32,0,32,8],[34,0,34,1],[12,0,12,5],[15,0,17,8],[27,0,27,1],[27,6,27,7],[25,0,25,1],[26,0,26,1],[25,6,25,7],[26,6,26,7],[21,0,21,8],[24,0,24,1],[14,0,14,5],[20,0,20,2],[29,6,29,7],[30,6,30,7],[5,2,5,6],[18,1,18,5],[24,6,24,7],[6,2,6,4],[7,6,7,8],[7,2,7,4],[20,5,20,6],[20,7,20,8],[5,0,5,1],[6,0,6,1],[7,0,7,1],[12,7,12,8]]}
[]
["Honorar og rejseudlægsblanket - Socialt frikort"]
["Version 1.3"]
[]
["Personlige oplysninger: (felter markeret med * skal udfyldes)",null,null,null,null,null,{"$f":"IF(LEN(I6)>10,\"Bemærk: Cpr. nr. indeholder mere end 10 cifre.\",\"\")","v":""}]
["Navn: *",null,null,null,null,null,null,"Cpr. nr.: *"]
["Adresse: *",null,null,null,null,"Postnr.: *",null,"By:  *"]
["Tlf. nr.: *",null,null,null,null,"E-mail: *"]
["Udbetaling sker automatisk til Nemkonto",null,null,null,null,null,null,null,{"$f":"IF(I6=\"\",\"\",IFERROR(IF(MID(I5,7,1)=\"-\",IF(0=MOD(LEFT(I5)*4+MID(I5,2,1)*3+MID(I5,3,1)*2+MID(I5,4,1)*7+MID(I5,5,1)*6+MID(I5,6,1)*5+(MID(I5,8,1)*4+MID(I5,9,1)*3)+MID(I5,10,1)*2+MID(I5,11,1)*1,11),\"\",\"Cpr-nummer er ej gyldigt\"),IF(0=MOD(LEFT(I5)*4+MID(I5,2,1)*3+MID(I5,3,1)*2+MID(I5,4,1)*7+MID(I5,5,1)*6+MID(I5,6,1)*5+(MID(I5,7,1)*4+MID(I5,8,1)*3)+MID(I5,9,1)*2+MID(I5,10,1)*1,11),\"\",\"Cpr-nummer er ej gyldigt\")),\"Cpr-nummer er ej gyldigt\"))","v":""}]
[]
[]
["Navn på kontaktperson i Social- og Boligstyrelsen: *",null,null,null,null,null,null,"Projektnummer: *"]
[]
[]
["Honorar/rejseudlæg ydes for (beskrivelse samt dato for honorar/rejseudlæg): *"]
[]
[]
[]
[]
[]
["Honorar/rejseudlæg udbetales som (sæt X) *",null,null,"Socialt frikort *",null,"Frikortsnummer *"]
["Honorar/rejseudlæg udbetales til NemKonto. Såfremt der er udgifter til kørsel i egen bil, sker udbetalingen heraf separat, men ligeledes til NemKonto."]
[]
[]
[null,null,"Finanskonto","Projektnummer","Skal udfyldes *",null,"Sats i kr. ",null,"Beløb"]
["Honorar - Socialt frikort",null,227092,{"$f":"IF(H13=\"\",\"\",H13)","v":""},null,"Kr. ",null,null,{"$f":"E26","v":0}]
["Kørsel lav sats",null,221006,{"$f":"IF(D26=\"\",\"\",D26)","v":""},null,"Km á kr.:",2.23,null,{"$f":"E27*G27","v":0}]
["Kørsel høj sats 1)",null,221006,{"$f":"IF(D27=\"\",\"\",D27)","v":""},null,"Km á kr.:",3.79,null,{"$f":"E28*G28","v":0}]
["Transport",null,221006,{"$f":"IF(D28=\"\",\"\",D28)","v":""},null,"Kr. ",null,null,{"$f":"E29","v":0}]
["Hoteludgifter",null,221059,{"$f":"IF(D29=\"\",\"\",D29)","v":""},null,"Kr. ",null,null,{"$f":"E30","v":0}]
["Bilens reg. nr.",null,"Ved kørsel SKAL bilens registreringsnummer påføres",null,null,null,null,null,{"$f":"SUM(I26:I30)","v":0}]
["Ved henvendelse fra Social- og Boligstyrelsen skal modtager af honorar/rejseudlæg kunne dokumentere sine udgifter jf. BEK nr. 70 af 27/01/2011 -  bekendtgørelse om statens regnskabsvæsen mv. §44. Modtageren har pligt til at gemme dokumentationen i fem år fra aktivitetsdato.\n"]
["1) Kørsel til høj sats udbetales kun efter aftale med kontaktperson i Social- og Boligstyrelsen."]
[]
["Dato",null,null,"Underskrift - modtager af honorar/rejseudlæg "]
[null,null,null,"Ved returnering af blanketten til Social- og Boligstyrelsen via E-boks, godkendes blankettens indhold elektronisk - det er da ikke nødvendigt med en fysisk underskrift."]
[]
[]
[]
[]
[]
[]
["Til Social- og Boligstyrelsen",null,null,null,null,null,null,null,"PKAT 091"]
[]
["Lønkode",null,null,"Km",null,"Lønkode",null,null,"Km"]
["5305 - Sats 3",null,"Kørsel lav sats (KM) - 1",{"$f":"+E27","v":0},null,"5305 - sats 1","Kørsel høj sats (KM) - 2",null,{"$f":"+I28","v":0}]
[]
["Delregnskab",null,"Segm1","Segm2","Segm 3","Segm4","Segm5",null,"Segm6"]
[null,null,"(sidste 2 cifre i finanskontonummer)","(Projekt-nummer)","(Indkøbs-\nkategori)","(Sted)","(Bud.an)",null,"(FL-formål)"]
[1,{"$f":"IF(I27=0,\"\",IF(ISERROR(VLOOKUP($D$26,Alias!$A:$L,5,FALSE)),\"\",VLOOKUP($D$26,Alias!$A:$L,5,FALSE)))","v":""},6,{"$f":"IF(I27=0,\"\",IF(ISERROR(VLOOKUP($D$26,Alias!$A:$L,6,FALSE)),\"\",VLOOKUP($D$26,Alias!$A:$L,6,FALSE)))","v":""},8310,{"$f":"IF(I27=0,\"\",IF(ISERROR(VLOOKUP($D$26,Alias!$A:$L,8,FALSE)),\"\",VLOOKUP($D$26,Alias!$A:$L,8,FALSE)))","v":""},{"$f":"IF(I27=0,\"\",IF(ISERROR(VLOOKUP($D$26,Alias!$A:$L,11,FALSE)),\"\",VLOOKUP($D$26,Alias!$A:$L,11,FALSE)))","v":""},null,{"$f":"IF(I27=0,\"\",IF(ISERROR(VLOOKUP($D$26,Alias!$A:$L,12,FALSE)),\"\",VLOOKUP($D$26,Alias!$A:$L,12,FALSE)))","v":""}]
[2,{"$f":"IF(I28=0,\"\",IF(ISERROR(VLOOKUP($D$26,[1]Alias!$A:$L,5,FALSE)),\"\",VLOOKUP($D$26,[1]Alias!$A:$L,5,FALSE)))","v":""},6,{"$f":"IF(I28=0,\"\",IF(ISERROR(VLOOKUP($D$26,[1]Alias!$A:$L,6,FALSE)),\"\",VLOOKUP($D$26,[1]Alias!$A:$L,6,FALSE)))","v":""},8310,{"$f":"IF(I28=0,\"\",IF(ISERROR(VLOOKUP($D$26,[1]Alias!$A:$L,8,FALSE)),\"\",VLOOKUP($D$26,[1]Alias!$A:$L,8,FALSE)))","v":""},{"$f":"IF(I28=0,\"\",IF(ISERROR(VLOOKUP($D$26,[1]Alias!$A:$L,11,FALSE)),\"\",VLOOKUP($D$26,[1]Alias!$A:$L,11,FALSE)))","v":""},null,{"$f":"IF(I28=0,\"\",IF(ISERROR(VLOOKUP($D$26,[1]Alias!$A:$L,12,FALSE)),\"\",VLOOKUP($D$26,[1]Alias!$A:$L,12,FALSE)))","v":""}]
[]
["Til Social- og Boligstyrelsen - Økonomi"]
[null,null,null,"Beløb","Indkøbskategori"]
[{"$f":"+A26","v":"Honorar - Socialt frikort"},null,null,{"$f":"I26","v":0}]
[{"$f":"+A29","v":"Transport"},null,null,{"$f":"I29","v":0},8310]
[{"$f":"+A30","v":"Hoteludgifter"},null,null,{"$f":"I30","v":0},8210]

{"sheet":"Alias","index":1,"n_rows":661,"n_cols":16,"rows_kept":661,"cut":false,"hidden":true,"merged":[]}
["Alias","Beskrivelse","Kontotype","Kontonr.","Delregnskab kode","Projektnummer Kode","Aktivitet kode","Sted kode","Projekt Kode","Indkoebskategori Kode","Budgetansvar Kode","FL-FORMÅL Kode","Sagsbeskrivelse","Sagsopgavebeskrivelse","Spærret","Rettet den"]
[10001,"Bevilling FL 12dels rater mv."," ",null,174,10001,null,"<BLANK>",null,null,null,810,null,null,"Nej","2020-07-28"]
[10002,"Personaleomkostninger"," ",null,174,10002,null,"<BLANK>",null,null,null,810,null,null,"Nej","2017-05-22"]
[10011,"Generel ledelse"," ",null,174,10011,null,"<BLANK>",null,null,null,940,null,null,"Nej","2017-05-22"]
[10021,"Driftsmæssigunderstøttelse"," ",null,174,10021,null,"<BLANK>",null,null,null,810,null,null,"Nej","2017-05-22"]
[10031,"Kompetenceudvikling"," ",null,174,10031,10031,"<BLANK>",550,null,null,940,null,null,"Nej","2017-05-22"]
[10041,"TR, AMIR og  MIO"," ",null,174,10041,null,"<BLANK>",null,null,null,810,null,null,"Nej","2017-05-22"]
[10051,"Kontormøder"," ",null,174,10051,null,"<BLANK>",null,null,null,940,null,null,"Nej","2017-05-22"]
[10061,"Satspuljearbejde og departementsbetjening"," ",null,174,10061,null,"<BLANK>",null,null,null,104,null,null,"Nej","2017-05-22"]
[10071,"Kontorramme"," ",null,174,10071,null,"<BLANK>",null,null,null,940,null,null,"Nej","2017-05-22"]
[10101,"Øvrig GB TIKO FL-formål 101"," ",null,174,10101,null,51,null,null,null,101,null,null,"Nej","2017-05-22"]
[10102,"Øvrig GB TIKO FL-formål 102"," ",null,174,10102,null,51,null,null,null,102,null,null,"Nej","2017-05-22"]
[10103,"Øvrig GB TIKO FL-formål 103"," ",null,174,10103,null,51,null,null,null,103,null,null,"Nej","2017-05-22"]
[10104,"Øvrig GB TIKO FL-formål 104"," ",null,174,10104,null,51,null,null,null,104,null,null,"Nej","2017-05-22"]
[10105,"Øvrig GB TIKO FL-formål 105"," ",null,174,10105,null,51,null,null,null,105,null,null,"Nej","2017-05-22"]
[10106,"Øvrig GB TIKO FL-formål 106"," ",null,174,10106,null,51,null,null,null,106,null,null,"Nej","2017-05-22"]
[10111,"Øvrig GB CDAM FL-formål 101"," ",null,174,10111,null,52,null,null,null,101,null,null,"Nej","2017-05-22"]
[10112,"Øvrig GB CDAM FL-formål 102"," ",null,174,10112,null,52,null,null,null,102,null,null,"Nej","2017-05-22"]
[10113,"Øvrig GB CDAM FL-formål 103"," ",null,174,10113,null,52,null,null,null,103,null,null,"Nej","2017-05-22"]
[10114,"Øvrig GB CDAM FL-formål 104"," ",null,174,10114,null,52,null,null,null,104,null,null,"Nej","2017-05-22"]
[10115,"Øvrig GB CDAM FL-formål 105"," ",null,174,10115,null,52,null,null,null,105,null,null,"Nej","2017-05-22"]
[10116,"Øvrig GB CDAM FL-formål 106"," ",null,174,10116,null,52,null,null,null,106,null,null,"Nej","2017-05-22"]
[10121,"Øvrig GB CBUF FL-formål 101"," ",null,174,10121,null,53,null,null,null,101,null,null,"Nej","2017-05-22"]
[10122,"Øvrig GB CBUF FL-formål 102"," ",null,174,10122,10122,53,550,null,null,102,null,null,"Nej","2017-05-22"]
[10123,"Øvrig GB CBUF FL-formål 103"," ",null,174,10123,null,53,null,null,null,103,null,null,"Nej","2017-05-22"]
[10124,"Øvrig GB CBUF FL-formål 104"," ",null,174,10124,null,53,null,null,null,104,null,null,"Nej","2017-05-22"]
[10125,"Øvrig GB CBUF FL-formål 105"," ",null,174,10125,null,53,null,null,null,105,null,null,"Nej","2017-05-22"]
[10126,"Øvrig GB CBUF FL-formål 106"," ",null,174,10126,null,53,null,null,null,106,null,null,"Nej","2017-05-22"]
[10131,"Øvrig GB VISO FL-formål 101"," ",null,174,10131,null,55,null,null,null,101,null,null,"Nej","2017-05-22"]
[10132,"Øvrig GB VISO FL-formål 102"," ",null,174,10132,null,55,null,null,null,102,null,null,"Nej","2017-05-22"]
[10133,"Øvrig GB VISO FL-formål 103"," ",null,174,10133,null,55,null,null,null,103,null,null,"Nej","2017-05-22"]
[10134,"Øvrig GB VISO FL-formål 104"," ",null,174,10134,null,55,null,null,null,104,null,null,"Nej","2017-05-22"]
[10135,"Øvrig GB VISO FL-formål 105"," ",null,174,10135,null,55,null,null,null,105,null,null,"Nej","2017-05-22"]
[10136,"Øvrig GB VISO FL-formål 106"," ",null,174,10136,null,55,null,null,null,106,null,null,"Nej","2017-05-22"]
[10141,"Øvrig GB CH FL-formål 101"," ",null,174,10141,null,71,null,null,null,101,null,null,"Nej","2018-08-17"]
[10142,"Øvrig GB CH FL-formål 102"," ",null,174,10142,null,71,null,null,null,102,null,null,"Nej","2018-08-17"]
[10143,"Øvrig GB CH FL-formål 103"," ",null,174,10143,null,71,null,null,null,103,null,null,"Nej","2018-08-17"]
[10144,"Øvrig GB CH FL-formål 104"," ",null,174,10144,null,71,null,null,null,104,null,null,"Nej","2018-08-17"]
[10145,"Øvrig GB CH FL-formål 105"," ",null,174,10145,null,71,null,null,null,105,null,null,"Nej","2018-08-17"]
[10146,"Øvrig GB CH FL-formål 106"," ",null,174,10146,null,71,null,null,null,106,null,null,"Nej","2018-08-17"]
[10151,"Øvrig GB CUV FL-formål 101"," ",null,174,10151,null,64,null,null,null,101,null,null,"Nej","2017-05-22"]
[10152,"Øvrig GB CUV FL-formål 102"," ",null,174,10152,null,64,null,null,null,102,null,null,"Nej","2017-05-22"]
[10153,"Øvrig GB CUV FL-formål 103"," ",null,174,10153,null,64,null,null,null,103,null,null,"Nej","2017-05-22"]
[10154,"Øvrig GB CUV FL-formål 104"," ",null,174,10154,null,64,null,null,null,104,null,null,"Nej","2017-05-22"]
[10155,"Øvrig GB CUV FL-formål 105"," ",null,174,10155,null,64,null,null,null,105,null,null,"Nej","2017-05-22"]
[10156,"Øvrig GB CUV FL-formål 106"," ",null,174,10156,null,64,null,null,null,106,null,null,"Nej","2017-05-22"]
[10161,"Øvrig GB CPS FL-formål 101"," ",null,174,10161,null,72,null,null,null,101,null,null,"Nej","2018-01-29"]
[10162,"Øvrig GB CPS FL-formål 102"," ",null,174,10162,null,72,null,null,null,102,null,null,"Nej","2018-01-29"]
[10163,"Øvrig GB CPS FL-formål 103"," ",null,174,10163,null,72,null,null,null,103,null,null,"Nej","2018-01-29"]
[10164,"Øvrig GB CPS FL-formål 104"," ",null,174,10164,null,72,null,null,null,104,null,null,"Nej","2018-01-29"]
[10165,"Øvrig GB CPS FL-formål 105"," ",null,174,10165,null,72,null,null,null,105,null,null,"Nej","2018-01-29"]
[10166,"Øvrig GB CPS FL-formål 106"," ",null,174,10166,null,72,null,null,null,106,null,null,"Nej","2018-01-29"]
[10191,"Koordination af specialrådgivningen (KaS)"," ",null,174,10191,null,55,null,null,552,103,null,null,"Nej","2017-05-22"]
[10201,"Søgefunktion "," ",null,174,10201,null,52,null,null,522,101,null,null,"Nej","2017-05-22"]
[10221,"Ungdomssanktionen 52303 (UR)"," ",null,174,10221,null,53,null,null,535,101,null,null,"Nej","2017-05-22"]
[10261,"VIAS rådgivning/drift"," ",null,174,10261,null,55,null,null,552,103,null,null,"Nej","2019-03-08"]
[10302,"VISO-rådgivning - ud af huset"," ",null,174,10302,null,55,null,null,552,103,null,null,"Nej","2019-01-08"]
[10303,"VISO-rådgivning - inhouse"," ",null,174,10303,null,55,null,null,552,103,null,null,"Nej","2019-01-08"]
[10304,"VISO-rådgivning - inhouse på tværs af forløb"," ",null,174,10304,null,55,null,null,552,103,null,null,"Nej","2019-01-08"]
[10305,"VISO-kvalitetsudvikling"," ",null,174,10305,null,55,null,null,552,103,null,null,"Nej","2019-01-08"]
[10306,"VISO-leverandørstyring"," ",null,174,10306,null,55,null,null,552,103,null,null,"Nej","2019-01-08"]
[10307,"VISO-vidensproduktion"," ",null,174,10307,null,55,null,null,552,103,null,null,"Nej","2019-01-08"]
[10331,"Kompetencecenter, prositution"," ",null,174,10331,null,64,null,null,643,101,null,null,"Nej","2017-05-22"]
[10412,"SOTI - Audit drift"," ",null,174,10412,null,51,null,null,512,105,null,null,"Nej","2017-05-22"]
[10414,"NATKO - Specialeplaner - spor 2"," ",null,174,10414,null,51,null,null,512,105,null,null,"Nej","2020-04-23"]
[10415,"NATKO - Specialeplaner - spor 3"," ",null,174,10415,null,51,null,null,512,101,null,null,"Nej","2021-01-05"]
[10451,"Udbud af VISOs ydelser"," ",null,174,10451,null,55,null,null,552,103,null,null,"Nej","2017-05-22"]
[10491,"VIAS - drift"," ",null,174,10491,null,25,null,null,252,103,null,null,"Nej","2017-05-22"]
[10531,"ESDH-drift og support"," ",null,174,10531,null,25,null,null,252,940,null,null,"Nej","2017-05-22"]
[10541,"IT-sikkerhed"," ",null,174,10541,null,25,null,null,252,940,null,null,"Nej","2021-01-14"]
[10551,"Support"," ",null,174,10551,null,25,null,null,252,940,null,null,"Nej","2017-05-22"]
[10561,"IT-analyser"," ",null,174,10561,null,25,null,null,252,940,null,null,"Nej","2018-07-02"]
[10581,"Internet/Intranet"," ",null,174,10581,null,25,null,null,252,940,null,null,"Nej","2017-05-22"]
[10591,"IT-licenser"," ",null,174,10591,null,25,null,null,252,940,null,null,"Nej","2017-05-22"]
[10601,"Fjernprint"," ",null,174,10601,null,25,null,null,252,940,null,null,"Nej","2017-05-22"]
[10611,"Ministerieordningen"," ",null,174,10611,null,52,null,null,522,101,null,null,"Nej","2017-05-22"]
[10631,"Statens IT"," ",null,174,10631,null,25,null,null,252,940,null,null,"Nej","2019-10-04"]
[10661,"SSP-uddannelse"," ",null,111,10661,null,53,null,null,535,102,null,null,"Nej","2020-02-20"]
[10681,"Standardisering "," ",null,174,10681,null,71,null,null,713,102,null,null,"Nej","2017-05-22"]
[10711,"Trivselsundersøgelse blandt anbragte børn"," ",null,174,10711,null,13,null,null,132,101,null,null,"Nej","2021-01-05"]
[10761,"Hjælpemiddelbasen"," ",null,174,10761,null,71,null,null,713,102,null,null,"Nej","2019-01-09"]
[10791,"Senfølgeområdet: Servicering af departementet"," ",null,174,10791,null,64,null,null,null,101,null,null,"Nej","2017-05-22"]
[10861,"Evaluering af implementering for friv.centrene"," ",null,174,10861,null,17,null,null,173,101,null,null,"Nej","2021-01-05"]
[10891,"Online Netværkene (GB)"," ",null,174,10891,null,71,null,null,713,102,null,null,"Nej","2019-02-01"]
[10921,"1000 dage Virksomme metoder"," ",null,111,10921,null,53,null,null,532,101,null,null,"Nej","2020-02-20"]
[10941,"Exitpakke til mennesker i prostitution"," ",null,174,10941,null,64,null,null,643,103,null,null,"Nej","2020-01-16"]
[10951,"Styrket indsats for implementering af HF"," ",null,174,10951,null,64,null,null,642,103,null,null,"Nej","2020-01-16"]
[10961,"Bedre rammer for overgangen til voksenlivet"," ",null,174,10961,null,71,null,null,713,103,null,null,"Nej","2020-01-16"]
[10971,"Fortsat understøttelse af Grønland"," ",null,111,10971,null,53,null,null,536,101,null,null,"Nej","2021-01-05"]
[10972,"Styrket indsats i Grønland, målopfølgning"," ",null,174,10972,null,52,null,null,522,102,null,null,"Nej","2020-09-30"]
[11011,"Øvrig grundbevilling - Direktion"," ",null,174,11011,null,10,null,null,101,940,null,null,"Nej","2017-05-22"]
[11012,"Øvrig grundbevilling - Ledelsessekretariat"," ",null,174,11012,null,22,null,null,222,940,null,null,"Nej","2017-05-22"]
[11013,"Øvrig grundbevilling - Økonomi"," ",null,174,11013,null,13,null,null,132,940,null,null,"Nej","2017-05-22"]
[11014,"Øvrig grundbevilling - Tilskudsforvaltning"," ",null,174,11014,null,17,null,null,172,940,null,null,"Nej","2017-05-22"]
[11015,"Øvrig grundbevilling - HR"," ",null,174,11015,null,23,null,null,232,940,null,null,"Nej","2020-11-26"]
[11016,"Øvrig grundbevilling - Service"," ",null,174,11016,null,22,null,null,223,940,null,null,"Nej","2017-05-22"]
[11017,"Øvrig grundbevilling - Jura"," ",null,174,11017,null,23,null,null,233,940,null,null,"Nej","2018-01-26"]
[11018,"Øvrig grundbevilling - IT"," ",null,174,11018,null,25,null,null,252,940,null,null,"Nej","2018-01-16"]
[11102,"Buchwaldsgade 35"," ",null,174,11102,null,22,null,null,223,940,null,null,"Nej","2019-08-22"]
[11103,"Skibhusvej 1 sal"," ",null,174,11103,null,22,null,null,223,940,null,null,"Nej","2017-05-22"]
[11104,"Skibhusvej 3 sal"," ",null,174,11104,null,22,null,null,223,940,null,null,"Nej","2017-05-22"]
[11105,"Skibhusvej lager/Buchwaldsgade lager"," ",null,174,11105,null,22,null,null,223,940,null,null,"Nej","2019-08-22"]
[11106,"Edisonsvej 18"," ",null,174,11106,null,22,null,null,223,940,null,null,"Nej","2017-05-22"]
[11108,"Edisonsvej 1"," ",null,174,11108,null,22,null,null,223,940,null,null,"Nej","2017-05-22"]
[11109,"Øvrige lokationer"," ",null,174,11109,null,22,null,null,223,940,null,null,"Nej","2018-11-06"]
[11111,"IT- og telefoniudstyr"," ",null,174,11111,null,25,null,null,252,940,null,null,"Nej","2017-05-22"]
[11121,"Direktionspuljen"," ",null,174,11121,null,10,null,null,101,940,null,null,"Nej","2017-05-22"]
[11131,"Ledelsesseminar"," ",null,174,11131,null,22,null,null,222,940,null,null,"Nej","2017-05-22"]
[11141,"Styrelsesseminar"," ",null,174,11141,null,22,null,null,222,940,null,null,"Nej","2017-05-22"]
[11161,"TAS"," ",null,174,11161,null,25,null,null,252,106,null,null,"Nej","2017-05-22"]
[11171,"Rekruttering"," ",null,174,11171,null,23,null,null,232,940,null,null,"Nej","2017-05-22"]
[11181,"APV, AMIR og trivsel"," ",null,174,11181,null,23,null,null,232,940,null,null,"Nej","2017-05-22"]
[11191,"Ledermåling"," ",null,174,11191,null,23,null,null,232,940,null,null,"Nej","2017-05-22"]
[11201,"Rejser og befordring (Pulje)"," ",null,174,11201,null,null,null,null,null,940,null,null,"Nej","2017-05-22"]
[11211,"Forplejning (Pulje)"," ",null,174,11211,null,null,null,null,null,940,null,null,"Nej","2017-05-22"]
[11212,"Repræsentation (Pulje)"," ",null,174,11212,null,null,null,null,null,940,null,null,"Nej","2017-05-22"]
[11271,"Pulje til kompetencemidler"," ",null,174,11271,null,23,null,null,232,940,null,null,"Nej","2019-03-01"]
[11281,"Konsulentbistand vedr. IT"," ",null,174,11281,null,25,null,null,252,940,null,null,"Nej","2019-04-11"]
[11655,"Kompetencefonden OK18"," ",null,174,11655,null,23,null,null,232,940,null,null,"Nej","2019-12-20"]
[11661,"FUSA midler 2018-2020"," ",null,174,11661,null,23,null,null,232,940,null,null,"Nej","2018-04-16"]
{"$rows_left_out":541}